RECOMMENDED: If you have Windows errors then we strongly recommend that you download and run this (Windows) Repair Tool.

Some owners of the iPhone 7 have complained about getting various iTunes errors when attempting to update. is able.

These are the errors the. extpersontype.h(35) : error C3646: ‘extPersonType’ : unknown override specifier extpersontype.h(37) : error C2091: function returns function extpersontype.h(44) : fatal error C1903: unable to.

I'm including the algorithm library in my program but am getting this crazy error when I. error C1903: unable to recover from previous errors made Last.

error c1903 unable to recover from previous errors. resources Windows Server 2012 resources Programs MSDN subscriptions Overview Benefits Administrators Students.

Aug 3, 2011. The compiler found too many errors to continue. Fatal Error C1903: unable to recover from previous error(s); stopping compilation. +2 votes.

Fix the errors and recompile. Compiler Fatal Errors C999 through C1999 Fatal Error C1903. unable to recover from previous error(s); stopping compilation.

templates – C++ Custom List Iterator Errors – Stack Overflow – Mar 17, 2015. Your last error is simply because you are attempting to call non-const operator->( ) on a const. The fix is to just create a const version of it that.

Post Authorization Status Error Nov 29, 2011  · Hi PtheDude, As this thread has been quiet for a while, we assume that the issue has been resolved. At this time, we will mark it as ‘Answered’ as the. The information in this document is based on Cisco IOS. (check keys) AAA/AUTHEN (1771887965): status =
Faultcode Channel.security.error Fault faultString="Security error accessing url" faultCode="Channel.Security.Error" a property or method of a null object reference. at Faultcode Channel.security.error Esri. Type the characters of the security code, and then click Create. The new key displays in the list of available keys. Error Ft2build H Hasnt Been Bug #100502 for Imager: #error
Error Ft2build H Hasnt Been Bug #100502 for Imager: #error "`ft2build.h' hasn't been included yet!" – Nov 21, 2014. If building on a freebsd 9.2 system with freetype2-2.5.3_2 installed, then compilation of fontft1.c fails with: In file included from fontft1.c:52:. Planet Fitness has been a great motivator for me over the years. "The loyalty from

Earnings call – Inphi and the rest of the industry have been unable to properly forecast this inventory situation. So this gives you a sense about the timing of the recovery. Furthermore, the general consensus is that we will have to wait until after the China.

Fatal Error C1903: unable to recover from previous error(s); stopping compilation +2 votes. The compiler found too many errors to continue. compile-time-error-messages;

RECOMMENDED: Click here to fix Windows errors and improve system performance

Categories: Blog

Related Posts

Blog

Internal Client Error Java.net.socketexception Permission Denied Connect

ESXi 6.5 Update 1 | 27 JULY 2017 | ISO Build 5969303. Check for additions and updates to these release notes. 645 Internal authentication error. 646 The account is not permitted to log on at Read more…

Blog

Unexpected Error 40230 Access

WIT – The Configure Features Wizard will update your team projects and you’ll get access to the latest features. If you encounter an Application detected an unexpected fault error when you connect to your team Read more…

Blog

Card Access Error Hp Photosmart 385

Runtime Error Handling In Qtp QTP Error Handling – Learn what is QTP (QuickTest Professional) and associated concepts like Record and Play Back, Object Repository, Actions, DataTables, Checkpoints. For application architects, it’s important to design Read more…