3dBuzz c++ mod 3 Error C2065 'level': undeclared identifier FIX

RECOMMENDED: If you have Windows errors then we strongly recommend that you download and run this (Windows) Repair Tool.

In this post, we will provide step by step instructions on how to install OpenCV 3 (C++ and Python) on Windows. However, we have found that a lot of readers want to.

cerr << "ERROR: WSACleanup unsuccessful" << endl; return(1); } cout << buffer << endl; } /* while */ } compiled it in ms vc++ 2005 and I got the following errors c: programsaaa.cpp(17) : error C2065: 'WSADATA' : undeclared identifier c: programsaaa.cpp(17) : error C2146: syntax error : missing ';' before.

TORONTO, Feb. 17, 2016 /CNW/ – Investors are expecting higher levels of transparency than ever before, holding their investment managers to the highest ethical standards, and are laser-focused on returns, according to a newly released.

Error Canon Mp250 E16 Here is all the process to fix the error E16 in Canon printers, follow all the steps, and if you have any other problem, please write a coment. Error Bar Graph Sas Building a Better Bar Chart with SAS/GRAPH® Software Perry Watts, Independent Consultant INTRODUCTION. Or get a bar chart

I am working on the ‘driver’ part of my programing assignment and i keep getting this absurd error: error C2065: ‘cout’ : undeclared identifier I have even tried.

Dec 4, 2000. Pong.cpp. C:My DocumentsEdemEdem's SoftwareEdem WorkspaceSoftware PongPong.cpp(255) : error C2065: 'glClear' : undeclared identifier. C:My DocumentsEdemEdem's SoftwareEdem WorkspaceSoftwarePongPong.cpp( 255) : error C2065: 'GL_COLOR_BUFFER_BIT' : undeclared identifier

I am currently trying to follow a tutorial on making a simple 2D tile engine for top-down RPGs. For some reason though I get the intellisense error vector is not a.

I am working on the 'driver' part of my programing assignment and i keep getting this absurd error: error C2065: 'cout' : undeclared identifier I have even tried.

error C2065: 'cout' : undeclared identifier – Hi, In Visual Studio there are two kinds of *.exe binaries, windows applications and console applications. A console application is has a single console.

i get errors like error C2065: 'Lstr' : undeclared identifier the function. I tried with TCHAR and also with WCHAR and i still get the compiler error. I have to. That is why if you put your str variable with the macro it gets converted to Lstr by the preprocessor, and you get a variable not declared error message.

vector – c++ error C2065 : undeclared identifier – Stack Overflow – Possible Duplicate: C++ Undeclared Identifier (but it is declared?) Im getting the error sprite.h(20): error C2065: 'Component' : undeclared identifier when I try to.

Alternative route: C2064 Smith End Green, C2064 Suckley Road, C2065 Brockamin to A4103 Bransford, C2065 Brockamin, C2065 Hopton Lane to Brockamin, C2245 Hopton Lane and vice versa. Proposed Order: to close that part.

A variable's type must be specified in a declaration before it can be used. The parameters that a function uses must be specified in a declaration, or prototype.

Intel has forums. Often people post questions there. It is likely that the problem has already been asked and answered. So be sure to check the Intel forum(s).

Error Ora-01435 User Does Not Exist This tutorial guides us on how to pass Array objects from Java to stored procedures in Oracle and also, how to retrieve an array object in Java. All PLSQL arrays can. When using a shared schema and trying to run an Explain Plan for a SQL in the Toad editor,

-permissive- (Standards conformance) | Microsoft Docs – Specify standards conformance mode to the compiler. Use this option to help you identify and fix conformance issues in your code, to make it both more correct and.

Hi, I am just in the stage of beginning compile 0.2.31 with VC++ 6 EE. I tried to compile libnetxms but I come across a message like to title of this topic. Could you let me know what is happenning? ——————–Configuration: libnetxms – Win32 Debug——————– Compiling. agent.cpp c:program.

Эта ошибка связана с отсутствием определения переделенной. Смотрим пример: #include "stdafx.h" int main(int argc, char* argv[]) { for (int x=0;x<y;x++) // y не объявлена { } return 0; }. Переменная y не определена: D:VСTestError TestError.cpp(12) : error C2065: 'y' : undeclared identifier. Основа этой ошибки в.

Free source code and tutorials for Software developers and Architects.; Updated: 29 Aug 2012

Error Bar Graph Sas Building a Better Bar Chart with SAS/GRAPH® Software Perry Watts, Independent Consultant INTRODUCTION. Or get a bar chart with both error bars and a legend? Feb 28, 2011. This sample illustrates how to plot means with standard error bars from calculated data with the SGPLOT procedure. License. The materials (math

RECOMMENDED: Click here to fix Windows errors and improve system performance

Categories: Blog

Related Posts

Blog

Internal Client Error Java.net.socketexception Permission Denied Connect

ESXi 6.5 Update 1 | 27 JULY 2017 | ISO Build 5969303. Check for additions and updates to these release notes. 645 Internal authentication error. 646 The account is not permitted to log on at Read more…

Blog

Unexpected Error 40230 Access

WIT – The Configure Features Wizard will update your team projects and you’ll get access to the latest features. If you encounter an Application detected an unexpected fault error when you connect to your team Read more…

Blog

Card Access Error Hp Photosmart 385

Runtime Error Handling In Qtp QTP Error Handling – Learn what is QTP (QuickTest Professional) and associated concepts like Record and Play Back, Object Repository, Actions, DataTables, Checkpoints. For application architects, it’s important to design Read more…