RECOMMENDED: If you have Windows errors then we strongly recommend that you download and run this (Windows) Repair Tool.

gcc-4.9.0/libbacktrace/dwarf.c:2873: error: '__ATOMIC_ACQUIRE' undeclared. error: undefined reference to 'dlsym' collect2: error: ld returned 1 exit status.

c++ – Error C2039: 'exit' and Error C2873: 'exit' (Suddenly. – I have a C++ and OpenGL/GLSL program that has been running fine all day. I took a break from programming and watched a movie. Upon coming back to my programming and.

解决error C2039 – 海姹网 – 2013年3月27日. 海姹网之MFC 编程栏目:《解决error C2039:. NET 2003Vc7includecstdlib(27) : error C2873:. using ::exit; using ::free; using ::getenv;.

Xbox 360 250gb Hard Drive Unformatted Error Find solutions to common Xbox 360 Hard Drive problems. the device may appear as "unformatted" and prompt you to format the hard. Error & Status Code Search Find solutions to common Xbox 360 Hard Drive problems. "No space available " error or “The destination device is full” error. If you're

Why would you want to do it? Why not, if I could do it before, why not in.NET? The better answer is that sometimes you just need a quick way to get some options hooked in without having to create a full menu and/or toolbar. Or maybe you.

2013年12月3日. 1. 2. if (FAILED(CreateTextServices(NULL, this , &pUnk))). goto err;. exit (0);. else. {. CTS = (_CTS)GetProcAddress(richHandle,

exit’ : is not a member of ‘`global namespace” c:program filesmicrosoft visual studio 9.0vcincludecstdlib 26 Error 5 error C2873: ‘exit’ : symbol cannot be used in a using-declaration c:program filesmicrosoft visual studio.

When using iostream in vs2010, I get error C2039:. (24): error C2873: 'exit' : symbol cannot be used in a using-declaration. I was trying to find some solution,

Note that objects with automatic storage are not destroyed by calling exit (C++). "r" ); if (pFile==NULL) { printf ( "Error opening file" ); exit (EXIT_FAILURE); }.

Error Launching Wineserver Failed Mac Запуск WoT на Mac — оставил сообщение в Полезные темы: Доброго. error ! launching wineserver failed! no new wineserver pid found! Hi, I tried to reinstall the unity web player plugin several times, but I always get the error launching unity player message (with Firefox) when. wineserver problems for fallout

error C2039: 'exit' : is not a member of '`global namespace'' error C2873: 'exit' : symbol cannot be used in a using-declaration. using _CSTD exit;.

error C2873: 'exit' : symbol cannot be used in a using-declaration I'm using glut.h and when i trace definition of exit its showing me to the one in glut.h,what is.

error C2873: ‘div’ : symbol cannot be used in a using-declaration1>E:Program FilesMicrosoft Visual Studio 9.0VCincludecstdlib(26) : error C2039: ‘exit’ : is not a member of ‘`global namespace”1>E:Program FilesMicrosoft.

error C2039: 'exit' : is not a member of '`global namespace''| error C2873: 'exit' : symbol cannot be used in a using-declaration| I wonder how to fix this.

Discover whats on and and review every TV show and Movie in this complete Netflix Australia library, includes new releases as well as popular titles!

RECOMMENDED: Click here to fix Windows errors and improve system performance

Categories: Blog

Related Posts

Blog

Internal Client Error Java.net.socketexception Permission Denied Connect

ESXi 6.5 Update 1 | 27 JULY 2017 | ISO Build 5969303. Check for additions and updates to these release notes. 645 Internal authentication error. 646 The account is not permitted to log on at Read more…

Blog

Unexpected Error 40230 Access

WIT – The Configure Features Wizard will update your team projects and you’ll get access to the latest features. If you encounter an Application detected an unexpected fault error when you connect to your team Read more…

Blog

Card Access Error Hp Photosmart 385

Runtime Error Handling In Qtp QTP Error Handling – Learn what is QTP (QuickTest Professional) and associated concepts like Record and Play Back, Object Repository, Actions, DataTables, Checkpoints. For application architects, it’s important to design Read more…