Beaglebone: Qt Creator for C++ ARM Embedded Linux Development

RECOMMENDED: If you have Windows errors then we strongly recommend that you download and run this (Windows) Repair Tool.

make – GCC error trying to exec ‘cc1’ – Unix & Linux. – GCC error trying to exec ‘cc1’. error trying to exec ‘cc1’: execvp: No such file or directory make[1]:. /usr/lib/gcc/i486-linux-gnu/4.7/cc1plus cpp-4.6:.

When I compile C/C++ program with popen in php. I got this error: g++: error trying to exec 'cc1plus': execvp: No such file or directory but if I run php code in.

Trilinos – c++: error trying to exec ‘cc1plus’:. error trying to exec ‘cc1plus’: execvp: No such file or directory. error trying to exec ‘cc1’: execvp: No such.

How do I compile C++ files? I made one (.cpp) and put it in my home folder and then. [email protected]:~$ gcc gcc: no input files [email protected]:~$ gcc test.cpp gcc: error trying to exec 'cc1plus': execvp: No such file or directory [email protected]:~$ how do i get this to work?

gcc: error trying to exec 'cc1plus': execvp: No such file or. – While I was installing some software on a client machine I got the following error: 1 2 gcc: error trying to exec 'cc1plus': execvp: No such file or.

. error trying to exec 'cc1': execvp: No such file or directory. "gcc: error trying to exec 'cc1plus': execvp: No such file or directory" on CentOS 6.7. 4.

When trying to run make -j2 -s as instructed from this guide, I am getting the following error. gcc: error trying to exec ‘cc1’: execvp: No such file or directory.

error trying to exec 'cc1plus': execvp: No such file or directory. From: Mahmood Naderan <nt_mahmood at yahoo dot com>; To: gcc <gcc-help at gcc dot gnu dot org>; Date: Sun, 10 Feb 2013 23:20:46 -0800 (PST); Subject: error trying to exec ' cc1plus': execvp: No such file or directory; Reply-to: Mahmood Naderan.

Oct 25, 2007. While I was installing some software on a client machine I got the following error: 1 2 gcc: error trying to exec 'cc1plus': execvp: No such file or.

Fix E74 Error Penny Trick It is caused by the HANA (scaler) chip loosening from the Motherboard. People get a quick fix by towel tricking it, but it still has room to seperate from the board. Now how would we fix this? This is how I did it, been fixed for about 2 weeks now.

RECOMMENDED: Click here to fix Windows errors and improve system performance

Categories: Blog

Related Posts

Blog

Internal Client Error Java.net.socketexception Permission Denied Connect

ESXi 6.5 Update 1 | 27 JULY 2017 | ISO Build 5969303. Check for additions and updates to these release notes. 645 Internal authentication error. 646 The account is not permitted to log on at Read more…

Blog

Unexpected Error 40230 Access

WIT – The Configure Features Wizard will update your team projects and you’ll get access to the latest features. If you encounter an Application detected an unexpected fault error when you connect to your team Read more…

Blog

Card Access Error Hp Photosmart 385

Runtime Error Handling In Qtp QTP Error Handling – Learn what is QTP (QuickTest Professional) and associated concepts like Record and Play Back, Object Repository, Actions, DataTables, Checkpoints. For application architects, it’s important to design Read more…