Spring Boot + FreeMarker Hello World Example

RECOMMENDED: If you have Windows errors then we strongly recommend that you download and run this (Windows) Repair Tool.

The above table is for GNU m4; unfortunately, the operators and precedence are version-dependent. Some versions of m4 incorrectly treat ^ the same as ** (exponent).

Expression error is undefined on line 35, column 4 in template/simple/actionerror.ftl.

Error 936 – Ora-00936 Missing Expression ORA-00936 missing expression. Cause: A required part of a clause or expression has been omitted. For example, a SELECT statement may have been entered. Database error: ORA-00936: missing expression. This question is answered. Hi Experts, I have created one Sales Object in IDT by using below condition. Oracle / PLSQL:
Vgaoem.fon Error Windows Xp Error Cracking Css Key For Video Ts The VideoLAN Forums. Get key for /VIDEO_TS/VTS_01_0.VOB at 0x000017f0 libdvdread: Error cracking CSS key for /VIDEO_TS/VTS_01_0.VOB (0x000017f0) My Thinkpad T42p has never run Windows XP, so it was necessary for me to set the DVD region from Linux before being able to play

freemarker.core.InvalidReferenceException: Error on line 69, Struts 2 FreeMarker Template Error stack.findValue('top') is undefined and jsp page. 1.

java – Freemarker template error: null or missing – Stack Overflow – May 28, 2017. The error message is right. In your Java code data is used as the data-model root. The root itself is not a top-level variable, but the container of the top-level variables. So for example ${Hello} would work, and print "Your not null!". (Also note that "data" is just a local variable name, which is gone during Java.

Oct 21, 2015. Freemarker error only when content is displayed as search result. Find answers. Share knowledge. Discuss everything related to Liferay. the search inside Liferay administration. This is the error message: 1Expression request['theme- display'] is undefined on line 170, column 101 in 20154#20194#23913.

In this post we will be developing a full-blown CRUD application using Spring Boot, AngularJS, Spring Data, JPA/Hibernate and MySQL, learning the concepts in details.

This page will walk through angular 2 NgIf example. NgIf is a directive that is used to add an element subtree to the DOM on the basis of true value of an expression.

Expression module.channels is undefined on line 143, column 6 in live.tpl. The problematic instruction: —– ==> if module.channels[0].text?? [on line 143, column 1 in live.tpl] —– Java backtrace for programmers: —–.

Per the message, a[ss] is undefined. So one possibility is that you have not set a in the freemarker model. Another possibility is that your a list is zero based, not.

Error Code Is 12002 Feb 19, 2009  · Troubleshooting guide for issues where WSUS clients are not reporting in ★ ★ ★ ★ ★ ★ ★ ★ ★ ★ ★ ★ ★ ★ ★ If you're looking for help on error code 3-4, please see Error code 3-4 when installing Office. You might see error

Error handling; Bookmarks:. [ERROR: Expression badVar is undefined on line 1, where you configure FreeMarker. Explicit error handling in templates.

08:10:41,991 ERROR [freemarker.runtime] Expression memberFirstName is undefined on line 2, Expression memberFirstName is undefined on line 2,

FreeMarker[edit]. <#if variable_to_test??>not null!<#else>null!</#if>. You can also use a ternary-like syntax: <#assign Threshold = 10/> <#if "11" > "10">. ${"AM greater than"} <#else> ${"AM less than"} </#if> This code will print n/a if x is not defined.

Oct 11, 2016. Getting error while trying to access the themeDisplay object: Caused by: freemarker.core.InvalidReferenceException: The following has evaluated to null or missing:_==> theme_display.getThemeSetting("some-string") [in template "lets -theme_SERVLET_CONTEXT_/templates/init_custom.ftl" at line 35,

[on line 22, column 17 in EnvironmentCanada/weatherSlice.tpl] —– Java backtrace for programmers: —– freemarker.core.InvalidReferenceException: Expression centre.currentConditions.temperature is undefined on line.

Freemarker Exception – freemarker.core.InvalidRefe. – I have followed steps provided in Tasks Overview page. But, I'm getting the exception from freemarker. I'm new to Freemarker. Please guide on how to resolve this issue. Thanks in advance, Exception from log. 2013-06-26 14:20:17, 378 ERROR [qtp690739569-139] [runtime] Expression uiConfigBean is undefined on line 2,

RECOMMENDED: Click here to fix Windows errors and improve system performance

Categories: Blog

Related Posts

Blog

Internal Client Error Java.net.socketexception Permission Denied Connect

ESXi 6.5 Update 1 | 27 JULY 2017 | ISO Build 5969303. Check for additions and updates to these release notes. 645 Internal authentication error. 646 The account is not permitted to log on at Read more…

Blog

Unexpected Error 40230 Access

WIT – The Configure Features Wizard will update your team projects and you’ll get access to the latest features. If you encounter an Application detected an unexpected fault error when you connect to your team Read more…

Blog

Card Access Error Hp Photosmart 385

Runtime Error Handling In Qtp QTP Error Handling – Learn what is QTP (QuickTest Professional) and associated concepts like Record and Play Back, Object Repository, Actions, DataTables, Checkpoints. For application architects, it’s important to design Read more…