RECOMMENDED: If you have Windows errors then we strongly recommend that you download and run this (Windows) Repair Tool.

Created by gravspeed on Sep 1, 2014 10:25 PM. python2.7-minimal dpkg: error processing /var/cache/apt/archives/python2.7-minimal_2.7.3-6+deb7u2_i386.deb (–unpack): subprocess new pre-installation script.

The former environmental minister for Germany’s most populous state wanted an electric car while in office, because, well, EVs are “green” and good for our.

Inside Social. The biggest and latest apps and platforms, plus trends and insights on the biggest online discussions

subprocess pre-removal script returned error exit status 2 dpkg. how to remove a package which post-installation and pre-removal script fails? #computers #it #.

Solved: apt-get remove unifi – Ubiquiti Networks Community – Registered: 10-06-2013. 10-29-2013 09:08 PM. (–remove): subprocess installed pre-removal script returned error exit status 1 configured to not write apport.

Even more » Account Options. Sign in; Search settings

rm: cannot remove `/etc/rc1.d/K20acpid’: No such file or directory dpkg: error processing acpid (–configure): subprocess installed post-installation script returned error exit status 1 Errors. 1:2.0.11-1 lt-nl 1.0.10-3 + dpkg –compare.

subprocess installed pre-removal script returned error exit status 2. According to dpkg, onlyoffice-documentserver version 4.3.4-10 is installed.

subprocess installed post-removal script returned error exit status 78. when installing/removing/updating a package with apt you should check the postinst.

Get the latest news and analysis in the stock market today, including national and world stock market news, business news, financial news and more.

Nvidia Driver Display Error This is also very simple, uninstall your current display drivers (I don’t care if they are the newest!) and run Driver Sweeper, make sure all of your graphics drivers. Power Management Solutions. Microprocessors. Embedded Microcontrollers. Apr 13, 2017. Nvidia Black screen problem “Display driver stopped working and has recovered” can

I do not have openSSH or ifile on my phone so i cant uninstall it that way!. " subprocess pre-removal script returned error exit status 127"

How-to – dpkg: error processing nginx (–purge): subprocess pre-removal script returned error exit status 1 Starting nginx: invoke-rc.d: initscript nginx, action "start" failed. dpkg: error while cleaning up: subprocess post-installation script.

WebSphere MQ provides periodic fixes for release 7.0. The following is a complete listing of available and scheduled fixes for Version 7.0 with the most recent fix at.

Hi guys ! I've a problem to remove a package via Cydia because of this errors : – subprocess pre-removal script returned error exit status 2 -.

Error 4156 I read the error codes for 4156 and it seems, you not configuring your Measurement Page properly. Do not leave any SMU/PGU/VSU/VMU un-configured. You get the error since PGU is not configured properly. I think I found the. The attempt to try Mutual Authentication generates the 4156 event, however the

Knex.js is a "batteries included" SQL query builder for Postgres, MSSQL, MySQL, MariaDB, SQLite3, and Oracle designed to be flexible, portable, and fun to use.

. /etc/rc2.d/S76nscd dpkg: warning: old pre-removal script returned error exit status 102 dpkg – trying script. script returned error exit. pre -installation.

A quick way to fix shell post / pre. Debian / Ubuntu Package Troubleshooting: subprocess post. subprocess post-removal script returned error exit status 10

. pre-removal script returned error exit. script returned error exit status 10. installed post-installation script returned error.

Sep 13, 2011. Understand dpkg and don't get stuck with a maintainer script failure. (– configure): subprocess installed post-installation script returned error exit status 1 Errors. + dpkg –compare-versions 1:2.0.11-1 lt-nl 1.0.10-3 + dpkg.

RECOMMENDED: Click here to fix Windows errors and improve system performance

Categories: Blog

Related Posts

Blog

Internal Client Error Java.net.socketexception Permission Denied Connect

ESXi 6.5 Update 1 | 27 JULY 2017 | ISO Build 5969303. Check for additions and updates to these release notes. 645 Internal authentication error. 646 The account is not permitted to log on at Read more…

Blog

Unexpected Error 40230 Access

WIT – The Configure Features Wizard will update your team projects and you’ll get access to the latest features. If you encounter an Application detected an unexpected fault error when you connect to your team Read more…

Blog

Card Access Error Hp Photosmart 385

Runtime Error Handling In Qtp QTP Error Handling – Learn what is QTP (QuickTest Professional) and associated concepts like Record and Play Back, Object Repository, Actions, DataTables, Checkpoints. For application architects, it’s important to design Read more…